Paste Code
Paste Blends
Paste Images
[ 99%] Linking CXX executable yafaray-xml
../yafraycore/libyafaray_v3_core.so: undefined reference to `cv::max(cv::Mat const&, cv::Mat const&)'
../yafraycore/libyafaray_v3_core.so: undefined reference to `cv::fastFree(void*)'
../yafraycore/libyafaray_v3_core.so: undefined reference to `cv::threshold(cv::_InputArray const&, cv::_OutputArray const&, double, double, int)'
../yafraycore/libyafaray_v3_core.so: undefined reference to `vtable for cv::_OutputArray'
../yafraycore/libyafaray_v3_core.so: undefined reference to `cv::Mat::create(int, int const*, int)'
../yafraycore/libyafaray_v3_core.so: undefined reference to `cv::GaussianBlur(cv::_InputArray const&, cv::_OutputArray const&, cv::Size_<int>, double, double, int)'
../yafraycore/libyafaray_v3_core.so: undefined reference to `cv::filter2D(cv::_InputArray const&, cv::_OutputArray const&, int, cv::_InputArray const&, cv::Point_<int>, double, int)'
../yafraycore/libyafaray_v3_core.so: undefined reference to `cv::_OutputArray::_OutputArray(cv::Mat&)'
../yafraycore/libyafaray_v3_core.so: undefined reference to `cv::_InputArray::_InputArray(cv::Mat const&)'
../yafraycore/libyafaray_v3_core.so: undefined reference to `vtable for cv::_InputArray'
../yafraycore/libyafaray_v3_core.so: undefined reference to `cv::Mat::ones(int, int, int)'
../yafraycore/libyafaray_v3_core.so: undefined reference to `cv::Mat::operator=(cv::Scalar_<double> const&)'
../yafraycore/libyafaray_v3_core.so: undefined reference to `cv::Laplacian(cv::_InputArray const&, cv::_OutputArray const&, int, int, double, double, int)'
../yafraycore/libyafaray_v3_core.so: undefined reference to `cv::Mat::copySize(cv::Mat const&)'
../yafraycore/libyafaray_v3_core.so: undefined reference to `cv::Mat::deallocate()'
../yafraycore/libyafaray_v3_core.so: undefined reference to `cv::operator/(cv::MatExpr const&, double)'
collect2: error: ld returned 1 exit status
src/xml_loader/CMakeFiles/yafaray-xml.dir/build.make:107: recipe for target 'src/xml_loader/yafaray-xml' failed
make[2]: *** [src/xml_loader/yafaray-xml] Error 1
CMakeFiles/Makefile2:2168: recipe for target 'src/xml_loader/CMakeFiles/yafaray-xml.dir/all' failed
make[1]: *** [src/xml_loader/CMakeFiles/yafaray-xml.dir/all] Error 2
make[1]: *** Waiting for unfinished jobs....
[100%] Linking CXX shared module _yafaray_v3_interface.so
[100%] Built target _yafaray_v3_interface
Makefile:149: recipe for target 'all' failed
make: *** [all] Error 2
  1. [ 99%] Linking CXX executable yafaray-xml
  2. ../yafraycore/libyafaray_v3_core.so: undefined reference to `cv::max(cv::Mat const&, cv::Mat const&)'
  3. ../yafraycore/libyafaray_v3_core.so: undefined reference to `cv::fastFree(void*)'
  4. ../yafraycore/libyafaray_v3_core.so: undefined reference to `cv::threshold(cv::_InputArray const&, cv::_OutputArray const&, double, double, int)'
  5. ../yafraycore/libyafaray_v3_core.so: undefined reference to `vtable for cv::_OutputArray'
  6. ../yafraycore/libyafaray_v3_core.so: undefined reference to `cv::Mat::create(int, int const*, int)'
  7. ../yafraycore/libyafaray_v3_core.so: undefined reference to `cv::GaussianBlur(cv::_InputArray const&, cv::_OutputArray const&, cv::Size_<int>, double, double, int)'
  8. ../yafraycore/libyafaray_v3_core.so: undefined reference to `cv::filter2D(cv::_InputArray const&, cv::_OutputArray const&, int, cv::_InputArray const&, cv::Point_<int>, double, int)'
  9. ../yafraycore/libyafaray_v3_core.so: undefined reference to `cv::_OutputArray::_OutputArray(cv::Mat&)'
  10. ../yafraycore/libyafaray_v3_core.so: undefined reference to `cv::_InputArray::_InputArray(cv::Mat const&)'
  11. ../yafraycore/libyafaray_v3_core.so: undefined reference to `vtable for cv::_InputArray'
  12. ../yafraycore/libyafaray_v3_core.so: undefined reference to `cv::Mat::ones(int, int, int)'
  13. ../yafraycore/libyafaray_v3_core.so: undefined reference to `cv::Mat::operator=(cv::Scalar_<double> const&)'
  14. ../yafraycore/libyafaray_v3_core.so: undefined reference to `cv::Laplacian(cv::_InputArray const&, cv::_OutputArray const&, int, int, double, double, int)'
  15. ../yafraycore/libyafaray_v3_core.so: undefined reference to `cv::Mat::copySize(cv::Mat const&)'
  16. ../yafraycore/libyafaray_v3_core.so: undefined reference to `cv::Mat::deallocate()'
  17. ../yafraycore/libyafaray_v3_core.so: undefined reference to `cv::operator/(cv::MatExpr const&, double)'
  18. collect2: error: ld returned 1 exit status
  19. src/xml_loader/CMakeFiles/yafaray-xml.dir/build.make:107: recipe for target 'src/xml_loader/yafaray-xml' failed
  20. make[2]: *** [src/xml_loader/yafaray-xml] Error 1
  21. CMakeFiles/Makefile2:2168: recipe for target 'src/xml_loader/CMakeFiles/yafaray-xml.dir/all' failed
  22. make[1]: *** [src/xml_loader/CMakeFiles/yafaray-xml.dir/all] Error 2
  23. make[1]: *** Waiting for unfinished jobs....
  24. [100%] Linking CXX shared module _yafaray_v3_interface.so
  25. [100%] Built target _yafaray_v3_interface
  26. Makefile:149: recipe for target 'all' failed
  27. make: *** [all] Error 2
  28.  
go to heaven